Target
Mitogen-activated protein kinase kinase kinase 5
Ligand
BDBM503634
Substrate
Meas. Tech.
Biochemical Assay
Kd
1500±n/a nM
Citation
 Jin, BDong, QHung, G Apoptosis signal-regulating kinase inhibitors and uses thereof US Patent  US11034671 Publication Date 6/15/2021 
Target
Name:
Mitogen-activated protein kinase kinase kinase 5
Synonyms:
ASK1 MAP3K5 MEKK5
Type:
Protein
Mol. Mass.:
154514.93
Organism:
Homo sapiens (Human)
Description:
Q99683
Residue:
1374
  
Inhibitor
Name:
BDBM503634
Synonyms:
US11034671, Example 21
Type:
Small organic molecule
Emp. Form.:
C26H23N5O2
Mol. Mass.:
437.4931
SMILES:
O=C1Nc2cccc(c2)-c2nncn2CCCOc2ccc(cc12)-c1ccc(nc1)C1CC1
: