Target
Mitogen-activated protein kinase kinase kinase 5
Ligand
BDBM50505950
Substrate
Meas. Tech.
Biochemical Assay
Kd
<100±n/a nM
Citation
 Jin, BDong, QHung, G Apoptosis signal-regulating kinase inhibitors and uses thereof US Patent  US11034671 Publication Date 6/15/2021 
Target
Name:
Mitogen-activated protein kinase kinase kinase 5
Synonyms:
ASK1 MAP3K5 MEKK5
Type:
Protein
Mol. Mass.:
154514.93
Organism:
Homo sapiens (Human)
Description:
Q99683
Residue:
1374
  
Inhibitor
Name:
BDBM50505950
Synonyms:
CHEMBL4548492 US11168095, Example 3
Type:
Small organic molecule
Emp. Form.:
C22H24N6O3
Mol. Mass.:
420.4644
SMILES:
O=C1Nc2cccc(n2)-c2nncn2CCCCOc2ccc(cc12)N1CCOCC1
: