Target
Mitogen-activated protein kinase kinase kinase 5
Ligand
BDBM503684
Substrate
Meas. Tech.
Biochemical Assay
Kd
<100±n/a nM
Citation
 Jin, BDong, QHung, G Apoptosis signal-regulating kinase inhibitors and uses thereof US Patent  US11034671 Publication Date 6/15/2021 
Target
Name:
Mitogen-activated protein kinase kinase kinase 5
Synonyms:
ASK1 MAP3K5 MEKK5
Type:
Protein
Mol. Mass.:
154514.93
Organism:
Homo sapiens (Human)
Description:
Q99683
Residue:
1374
  
Inhibitor
Name:
BDBM503684
Synonyms:
US11034671, Example 77
Type:
Small organic molecule
Emp. Form.:
C25H22N6O2
Mol. Mass.:
438.4812
SMILES:
Cc1ccc(cn1)-c1ccc2OCC3C[C@@H]3Cn3cnnc3-c3cccc(NC(=O)c2c1)n3
: