Target
Mitogen-activated protein kinase kinase kinase 5
Ligand
BDBM503706
Substrate
Meas. Tech.
Biochemical Assay
Kd
<100±n/a nM
Citation
 Jin, BDong, QHung, G Apoptosis signal-regulating kinase inhibitors and uses thereof US Patent  US11034671 Publication Date 6/15/2021 
Target
Name:
Mitogen-activated protein kinase kinase kinase 5
Synonyms:
ASK1 MAP3K5 MEKK5
Type:
Protein
Mol. Mass.:
154514.93
Organism:
Homo sapiens (Human)
Description:
Q99683
Residue:
1374
  
Inhibitor
Name:
BDBM503706
Synonyms:
US11034671, Example 100
Type:
Small organic molecule
Emp. Form.:
C24H21FN6O2
Mol. Mass.:
444.4609
SMILES:
FCc1ccc(cn1)-c1ccc2COCCCn3cnnc3-c3cccc(NC(=O)c2c1)n3
: