Target
Diacylglycerol O-acyltransferase 2
Ligand
BDBM503720
Substrate
Meas. Tech.
In Vitro Assay
IC50
35.4±n/a nM
Citation
 Boehm, MCabral, SDowling, MSFutatsugi, KHuard, KLee, ECLondregan, ATPolivkova, JPrice, DALi, Q Diacylglycerol acyl transferase 2 inhibitors US Patent  US11034678 Publication Date 6/15/2021 
Target
Name:
Diacylglycerol O-acyltransferase 2
Synonyms:
ARAT DGAT2 Diacylglycerol O-acyltransferase 2 (DGAT2) Retinol O-fatty-acyltransferase
Type:
Multi-pass membrane protein
Mol. Mass.:
43848.90
Organism:
Homo sapiens (Human)
Description:
Q96PD7
Residue:
388
  
Inhibitor
Name:
BDBM503720
Synonyms:
US11034678, Example 3.6
Type:
Small organic molecule
Emp. Form.:
C22H25N5O5S
Mol. Mass.:
471.529
SMILES:
CCOc1cccnc1Oc1cncc(c1)-c1ncc(cn1)C(=O)NC(C)(C)CS(C)(=O)=O
: