Target
Diacylglycerol O-acyltransferase 2
Ligand
BDBM276759
Substrate
Meas. Tech.
In Vitro Assay
IC50
7.40±n/a nM
Citation
 Boehm, MCabral, SDowling, MSFutatsugi, KHuard, KLee, ECLondregan, ATPolivkova, JPrice, DALi, Q Diacylglycerol acyl transferase 2 inhibitors US Patent  US11034678 Publication Date 6/15/2021 
Target
Name:
Diacylglycerol O-acyltransferase 2
Synonyms:
ARAT DGAT2 Diacylglycerol O-acyltransferase 2 (DGAT2) Retinol O-fatty-acyltransferase
Type:
Multi-pass membrane protein
Mol. Mass.:
43848.90
Organism:
Homo sapiens (Human)
Description:
Q96PD7
Residue:
388
  
Inhibitor
Name:
BDBM276759
Synonyms:
US10071992, Example 4 | US11034678, Example 4
Type:
Small organic molecule
Emp. Form.:
C21H20N6O3
Mol. Mass.:
404.4219
SMILES:
CCOc1cccnc1Oc1cncc(c1)-c1ncc(cn1)C(=O)NC(C)(C)C#N
: