Target
Sphingosine 1-phosphate receptor 3
Ligand
BDBM399301
Substrate
Meas. Tech.
Competition Binding Assay
IC50
21.0±n/a nM
Citation
 Roberts, ERosen, HUrbano, MGuerrero, M Sphinogosine-1 -phosphate receptor modulators for treatment of cardiopulmonary disorders US Patent  US11034691 Publication Date 6/15/2021 
Target
Name:
Sphingosine 1-phosphate receptor 3
Synonyms:
C9orf108 EDG3 S1P receptor 3 S1P3 S1PR3_HUMAN Sphingosine 1-phosphate receptor 3 (S1P3) | Sphingosine 1-phosphate receptor Edg-3
Type:
G Protein-Coupled Receptor (GPCR)
Mol. Mass.:
42278.13
Organism:
Homo sapiens (Human)
Description:
Q99500
Residue:
378
  
Inhibitor
Name:
BDBM399301
Synonyms:
US10323029, Generic formula 52607 IB | US11034691, CYM generic formula 52607 IB
Type:
Small organic molecule
Emp. Form.:
C22H16Cl3N3O
Mol. Mass.:
444.741
SMILES:
Cc1cc(cc(C)c1C#N)C(=O)N[C@@H](c1ccc(Cl)c(Cl)c1)c1ccc(Cl)cn1
: