Target
Mitogen-activated protein kinase kinase kinase kinase 1
Ligand
BDBM503879
Substrate
Meas. Tech.
Binding Assay
Ki
0.020±n/a nM
Citation
 Chan, BDaniels, BDrobnick, JGazzard, LHeffron, THuestis, MLiang, JMalhotra, SMendonca, RRajapaksa, NSiu, MStivala, CTellis, JWang, WWei, BZhou, ACartwright, MWGancia, EJones, GLainchbury, MMadin, ASeward, EFavor, DFong, KCGood, AHu, YHu, BLu, A Naphthyridines as inhibitors of HPK1 US Patent  US11034692 Publication Date 6/15/2021 
Target
Name:
Mitogen-activated protein kinase kinase kinase kinase 1
Synonyms:
HPK1 MAP4K1
Type:
PROTEIN
Mol. Mass.:
91316.07
Organism:
Homo sapiens (Human)
Description:
ChEMBL_586597
Residue:
833
  
Inhibitor
Name:
BDBM503879
Synonyms:
1-[3-[4-[[8-amino-6-(4-methyl-3-pyridyl)- 2,7-naphthyridin-3-yl]amino]pyrazol-1- yl]azetidin-1-yl]ethanone | US11034692, Compound 161
Type:
Small organic molecule
Emp. Form.:
C22H22N8O
Mol. Mass.:
414.4631
SMILES:
CC(=O)N1CC(C1)n1cc(Nc2cc3cc(nc(N)c3cn2)-c2cnccc2C)cn1
: