Target
Mitogen-activated protein kinase kinase kinase kinase 1
Ligand
BDBM503978
Substrate
Meas. Tech.
Binding Assay
Ki
0.022±n/a nM
Citation
 Chan, BDaniels, BDrobnick, JGazzard, LHeffron, THuestis, MLiang, JMalhotra, SMendonca, RRajapaksa, NSiu, MStivala, CTellis, JWang, WWei, BZhou, ACartwright, MWGancia, EJones, GLainchbury, MMadin, ASeward, EFavor, DFong, KCGood, AHu, YHu, BLu, A Naphthyridines as inhibitors of HPK1 US Patent  US11034692 Publication Date 6/15/2021 
Target
Name:
Mitogen-activated protein kinase kinase kinase kinase 1
Synonyms:
HPK1 MAP4K1
Type:
PROTEIN
Mol. Mass.:
91316.07
Organism:
Homo sapiens (Human)
Description:
ChEMBL_586597
Residue:
833
  
Inhibitor
Name:
BDBM503978
Synonyms:
US11034692, Compound 247
Type:
Small organic molecule
Emp. Form.:
C20H19N7O
Mol. Mass.:
373.4112
SMILES:
Cc1c(N)cncc1-c1cc2cc(NC(=O)[C@H]3C[C@@H]3CC#N)ncc2c(N)n1
: