Target
Mitogen-activated protein kinase kinase kinase kinase 1
Ligand
BDBM504032
Substrate
Meas. Tech.
Binding Assay
Ki
0.069±n/a nM
Citation
 Chan, BDaniels, BDrobnick, JGazzard, LHeffron, THuestis, MLiang, JMalhotra, SMendonca, RRajapaksa, NSiu, MStivala, CTellis, JWang, WWei, BZhou, ACartwright, MWGancia, EJones, GLainchbury, MMadin, ASeward, EFavor, DFong, KCGood, AHu, YHu, BLu, A Naphthyridines as inhibitors of HPK1 US Patent  US11034692 Publication Date 6/15/2021 
Target
Name:
Mitogen-activated protein kinase kinase kinase kinase 1
Synonyms:
HPK1 MAP4K1
Type:
PROTEIN
Mol. Mass.:
91316.07
Organism:
Homo sapiens (Human)
Description:
ChEMBL_586597
Residue:
833
  
Inhibitor
Name:
BDBM504032
Synonyms:
(1R,2R)—N-[8-amino-6-(5-cyano-2-methylphenyl)-2,7-naphthyridin-3-yl]-2-(1-methyl-1H-pyrazol-4-yl)cyclopropane-1-carboxamide (Compound 300) and (1S,2S)—N-[8-amino-6-(5-cyano-2-methylphenyl)-2,7-naphthyridin-3-yl]-2-(1-methyl-1H-pyrazol-4-yl)cyclopropane-1-carboxamide | US11034692, Compound 301
Type:
Small organic molecule
Emp. Form.:
C24H21N7O
Mol. Mass.:
423.4698
SMILES:
Cc1ccc(cc1-c1cc2cc(NC(=O)[C@H]3C[C@@H]3c3cnn(C)c3)ncc2c(N)n1)C#N
: