Target
Mitogen-activated protein kinase kinase kinase kinase 1
Ligand
BDBM500373
Substrate
Meas. Tech.
Biochemical Enzyme Assay
IC50
<100±n/a nM
Citation
 Kaila, NLinney, IWard, SWishart, GWhittaker, BCote, AGreenwood, JRLeffler, AAlbanese, SKSeverance, DL Substituted isoindolin-1-ones and 2,3-dihydro-1H-pyrrolo[3,4-c]pyridin-1-ones as HPK1 antagonists US Patent  US11034694 Publication Date 6/15/2021 
Target
Name:
Mitogen-activated protein kinase kinase kinase kinase 1
Synonyms:
HPK1 MAP4K1
Type:
PROTEIN
Mol. Mass.:
91316.07
Organism:
Homo sapiens (Human)
Description:
ChEMBL_586597
Residue:
833
  
Inhibitor
Name:
BDBM500373
Synonyms:
7-[[5-(4- methylpiperazin- 1-yl)-2- pyridyl]amino]- 4-(1H- pyrrolo[2,3- b]pyridin-4- yl)-isoindolin- 1-one US11078201, Compound I-31 | US11548890, Compound I-31
Type:
Small organic molecule
Emp. Form.:
C25H25N7O
Mol. Mass.:
439.5123
SMILES:
CN1CCN(CC1)c1ccc(Nc2ccc(c3CNC(=O)c23)-c2ccnc3[nH]ccc23)nc1
: