Target
Mitogen-activated protein kinase kinase kinase kinase 1
Ligand
BDBM500519
Substrate
Meas. Tech.
Biochemical Enzyme Assay
IC50
<100±n/a nM
Citation
 Kaila, NLinney, IWard, SWishart, GWhittaker, BCote, AGreenwood, JRLeffler, AAlbanese, SKSeverance, DL Substituted isoindolin-1-ones and 2,3-dihydro-1H-pyrrolo[3,4-c]pyridin-1-ones as HPK1 antagonists US Patent  US11034694 Publication Date 6/15/2021 
Target
Name:
Mitogen-activated protein kinase kinase kinase kinase 1
Synonyms:
HPK1 MAP4K1
Type:
PROTEIN
Mol. Mass.:
91316.07
Organism:
Homo sapiens (Human)
Description:
ChEMBL_586597
Residue:
833
  
Inhibitor
Name:
BDBM500519
Synonyms:
7-[[5-[(3R)-3- hydroxy-1- piperidyl]-2- pyridyl]amino]-4-(1- methylpyrrolo [2,3-b]pyridin- 4-yl)-2,3- dihydropyrrolo [3,4-c]pyridin-1- one US11078201, Compound I-178 | US11548890, Compound I-178
Type:
Small organic molecule
Emp. Form.:
C25H25N7O2
Mol. Mass.:
455.5117
SMILES:
Cn1ccc2c(ccnc12)-c1ncc(Nc2ccc(cn2)N2CCC[C@@H](O)C2)c2C(=O)NCc12
: