Target
Mitogen-activated protein kinase kinase kinase kinase 1
Ligand
BDBM500543
Substrate
Meas. Tech.
Biochemical Enzyme Assay
IC50
<100±n/a nM
Citation
 Kaila, NLinney, IWard, SWishart, GWhittaker, BCote, AGreenwood, JRLeffler, AAlbanese, SKSeverance, DL Substituted isoindolin-1-ones and 2,3-dihydro-1H-pyrrolo[3,4-c]pyridin-1-ones as HPK1 antagonists US Patent  US11034694 Publication Date 6/15/2021 
Target
Name:
Mitogen-activated protein kinase kinase kinase kinase 1
Synonyms:
HPK1 MAP4K1
Type:
PROTEIN
Mol. Mass.:
91316.07
Organism:
Homo sapiens (Human)
Description:
ChEMBL_586597
Residue:
833
  
Inhibitor
Name:
BDBM500543
Synonyms:
4-(7-fluoroimidazo [1,2-a]pyridin- 3-yl)-7-[[5- 1(3R)-3-(1- hydroxy-1- methyl-ethyl)- 1-piperidyl]-2- pyridyl]amino] isoindolin-1-one US11078201, Compound I-202 | US11548890, Compound I-202
Type:
Small organic molecule
Emp. Form.:
C28H29FN6O2
Mol. Mass.:
500.5673
SMILES:
CC(C)(O)[C@@H]1CCCN(C1)c1ccc(Nc2ccc(c3CNC(=O)c23)-c2cnc3cc(F)ccn23)nc1
: