Target
Mitogen-activated protein kinase kinase kinase kinase 1
Ligand
BDBM501083
Substrate
Meas. Tech.
Biochemical Enzyme Assay
IC50
<100±n/a nM
Citation
 Kaila, NLinney, IWard, SWishart, GWhittaker, BCote, AGreenwood, JRLeffler, AAlbanese, SKSeverance, DL Substituted isoindolin-1-ones and 2,3-dihydro-1H-pyrrolo[3,4-c]pyridin-1-ones as HPK1 antagonists US Patent  US11034694 Publication Date 6/15/2021 
Target
Name:
Mitogen-activated protein kinase kinase kinase kinase 1
Synonyms:
HPK1 MAP4K1
Type:
PROTEIN
Mol. Mass.:
91316.07
Organism:
Homo sapiens (Human)
Description:
ChEMBL_586597
Residue:
833
  
Inhibitor
Name:
BDBM501083
Synonyms:
(R)-7-((6- (azetidin-1- ylmethyl)-5- (tetrahydrofuran- 3-yl)pyridin- 2-yl)amino)-4- (7-fluoroimidazo [1,2-a]pyridin- 3-yl)isoindolin- 1-one US11078201, Compound I-755 | US11548890, Compound I-755
Type:
Small organic molecule
Emp. Form.:
C28H27FN6O2
Mol. Mass.:
498.5514
SMILES:
Fc1ccn2c(cnc2c1)-c1ccc(Nc2ccc([C@H]3CCOC3)c(CN3CCC3)n2)c2C(=O)NCc12
: