Target
Mitogen-activated protein kinase kinase kinase kinase 1
Ligand
BDBM501174
Substrate
Meas. Tech.
Biochemical Enzyme Assay
IC50
<100±n/a nM
Citation
 Kaila, NLinney, IWard, SWishart, GWhittaker, BCote, AGreenwood, JRLeffler, AAlbanese, SKSeverance, DL Substituted isoindolin-1-ones and 2,3-dihydro-1H-pyrrolo[3,4-c]pyridin-1-ones as HPK1 antagonists US Patent  US11034694 Publication Date 6/15/2021 
Target
Name:
Mitogen-activated protein kinase kinase kinase kinase 1
Synonyms:
HPK1 MAP4K1
Type:
PROTEIN
Mol. Mass.:
91316.07
Organism:
Homo sapiens (Human)
Description:
ChEMBL_586597
Residue:
833
  
Inhibitor
Name:
BDBM501174
Synonyms:
7-[[6- [(dimethylamino)- methyl]-5- tetrahydrofuran- 3-yl-2- pyridyl]amino]- 4-(7- methylimidazo [1,2-a]pyrimidin-3- yl)isoindolin- 1-one US11078201, Compound I-846 | US11548890, Compound I-846
Type:
Small organic molecule
Emp. Form.:
C27H29N7O2
Mol. Mass.:
483.5649
SMILES:
CN(C)Cc1nc(Nc2ccc(c3CNC(=O)c23)-c2cnn3cc(C)cnc23)ccc1C1CCOC1
: