Target
Nuclear receptor ROR-gamma
Ligand
BDBM504168
Substrate
Meas. Tech.
Transcreener-Fluorecescence Polarization Assay
Ki
18.0±n/a nM
Citation
 Bryan, MCDo, SDrobnick, JGobbi, AKatsumoto, TKiefer, Jr., JRLiang, JRajapaksa, NSChen, YFu, LLai, KWLiu, ZWai, JWang, F Pyrazolo[ 1,5a]pyrimidine derivatives as IRAK4 modulators US Patent  US11034698 Publication Date 6/15/2021 
Target
Name:
Nuclear receptor ROR-gamma
Synonyms:
NR1F3 Nuclear receptor ROR-gamma (RORC) RAR-related orphan receptor C (RORc) RORG RZRG Retinoid-related orphan receptor-gamma (RORc)
Type:
Enzyme Catalytic Domain
Mol. Mass.:
58218.40
Organism:
Homo sapiens (Human)
Description:
P51449
Residue:
518
  
Inhibitor
Name:
BDBM504168
Synonyms:
N-[2,2-dimethyl-6-[4-[(3- methyl-6-oxo-1H-pyridin-2- yl)methyl]piperazin-1-yl]-3H- benzofuran-5-yl]pyrazolo[1,5- a]pyrimidine-3-carboxamide | US11034698, Example 5
Type:
Small organic molecule
Emp. Form.:
C28H31N7O3
Mol. Mass.:
513.5908
SMILES:
Cc1ccc(=O)[nH]c1CN1CCN(CC1)c1cc2OC(C)(C)Cc2cc1NC(=O)c1cnn2cccnc12
: