Target
Nuclear receptor ROR-gamma
Ligand
BDBM504187
Substrate
Meas. Tech.
Transcreener-Fluorecescence Polarization Assay
Ki
90.0±n/a nM
Citation
 Bryan, MCDo, SDrobnick, JGobbi, AKatsumoto, TKiefer, Jr., JRLiang, JRajapaksa, NSChen, YFu, LLai, KWLiu, ZWai, JWang, F Pyrazolo[ 1,5a]pyrimidine derivatives as IRAK4 modulators US Patent  US11034698 Publication Date 6/15/2021 
Target
Name:
Nuclear receptor ROR-gamma
Synonyms:
NR1F3 Nuclear receptor ROR-gamma (RORC) RAR-related orphan receptor C (RORc) RORG RZRG Retinoid-related orphan receptor-gamma (RORc)
Type:
Enzyme Catalytic Domain
Mol. Mass.:
58218.40
Organism:
Homo sapiens (Human)
Description:
P51449
Residue:
518
  
Inhibitor
Name:
BDBM504187
Synonyms:
US11034698, Example 24 | US11034698, Example 25
Type:
Small organic molecule
Emp. Form.:
C23H25N5O4
Mol. Mass.:
435.4757
SMILES:
CN1C[C@H](COc2cc3OC(C)(C)Cc3cc2NC(=O)c2cnn3cccnc23)CC1=O
: