Target
Nuclear receptor ROR-gamma
Ligand
BDBM504189
Substrate
Meas. Tech.
Transcreener-Fluorecescence Polarization Assay
Ki
280±n/a nM
Citation
 Bryan, MCDo, SDrobnick, JGobbi, AKatsumoto, TKiefer, Jr., JRLiang, JRajapaksa, NSChen, YFu, LLai, KWLiu, ZWai, JWang, F Pyrazolo[ 1,5a]pyrimidine derivatives as IRAK4 modulators US Patent  US11034698 Publication Date 6/15/2021 
Target
Name:
Nuclear receptor ROR-gamma
Synonyms:
NR1F3 Nuclear receptor ROR-gamma (RORC) RAR-related orphan receptor C (RORc) RORG RZRG Retinoid-related orphan receptor-gamma (RORc)
Type:
Enzyme Catalytic Domain
Mol. Mass.:
58218.40
Organism:
Homo sapiens (Human)
Description:
P51449
Residue:
518
  
Inhibitor
Name:
BDBM504189
Synonyms:
US11034698, Example 26 US11034698, Example 28 | US11034698, Example 29
Type:
Small organic molecule
Emp. Form.:
C27H27N5O3
Mol. Mass.:
469.535
SMILES:
CC1(C)Cc2cc(NC(=O)c3cnn4cccnc34)c(OC[C@@H]3Cc4ccccc4[C@H]3N)cc2O1
: