Target
Nuclear receptor ROR-gamma
Ligand
BDBM504215
Substrate
Meas. Tech.
Transcreener-Fluorecescence Polarization Assay
Ki
0.280±n/a nM
Citation
 Bryan, MCDo, SDrobnick, JGobbi, AKatsumoto, TKiefer, Jr., JRLiang, JRajapaksa, NSChen, YFu, LLai, KWLiu, ZWai, JWang, F Pyrazolo[ 1,5a]pyrimidine derivatives as IRAK4 modulators US Patent  US11034698 Publication Date 6/15/2021 
Target
Name:
Nuclear receptor ROR-gamma
Synonyms:
NR1F3 Nuclear receptor ROR-gamma (RORC) RAR-related orphan receptor C (RORc) RORG RZRG Retinoid-related orphan receptor-gamma (RORc)
Type:
Enzyme Catalytic Domain
Mol. Mass.:
58218.40
Organism:
Homo sapiens (Human)
Description:
P51449
Residue:
518
  
Inhibitor
Name:
BDBM504215
Synonyms:
N-[6-(3-Fluorocyclobutoxy)-2- [(2R)-2-fluoro-3-hydroxy-3- methyl-butyl]-1-oxo-isoindolin- 5-yl]pyrazolo[1,5-a]pyrimidine- 3-carboxamide | US11034698, Example 61
Type:
Small organic molecule
Emp. Form.:
C24H25F2N5O4
Mol. Mass.:
485.4832
SMILES:
CC(C)(O)[C@H](F)CN1Cc2cc(NC(=O)c3cnn4cccnc34)c(O[C@@H]3C[C@H](F)C3)cc2C1=O
: