Target
Nuclear receptor ROR-gamma
Ligand
BDBM50511348
Substrate
Meas. Tech.
Transcreener-Fluorecescence Polarization Assay
Ki
3.40±n/a nM
Citation
 Bryan, MCDo, SDrobnick, JGobbi, AKatsumoto, TKiefer, Jr., JRLiang, JRajapaksa, NSChen, YFu, LLai, KWLiu, ZWai, JWang, F Pyrazolo[ 1,5a]pyrimidine derivatives as IRAK4 modulators US Patent  US11034698 Publication Date 6/15/2021 
Target
Name:
Nuclear receptor ROR-gamma
Synonyms:
NR1F3 Nuclear receptor ROR-gamma (RORC) RAR-related orphan receptor C (RORc) RORG RZRG Retinoid-related orphan receptor-gamma (RORc)
Type:
Enzyme Catalytic Domain
Mol. Mass.:
58218.40
Organism:
Homo sapiens (Human)
Description:
P51449
Residue:
518
  
Inhibitor
Name:
BDBM50511348
Synonyms:
CHEMBL4566431 | US11034698, Example 105
Type:
Small organic molecule
Emp. Form.:
C27H32FN7O4
Mol. Mass.:
537.5859
SMILES:
CC(C)(O)[C@H](F)CN1Cc2cc(NC(=O)c3cnn4cccnc34)c(cc2C1=O)N1CCN(CC1)C1COC1
: