Target
Nuclear receptor ROR-gamma
Ligand
BDBM504262
Substrate
Meas. Tech.
Transcreener-Fluorecescence Polarization Assay
Ki
2.60±n/a nM
Citation
 Bryan, MCDo, SDrobnick, JGobbi, AKatsumoto, TKiefer, Jr., JRLiang, JRajapaksa, NSChen, YFu, LLai, KWLiu, ZWai, JWang, F Pyrazolo[ 1,5a]pyrimidine derivatives as IRAK4 modulators US Patent  US11034698 Publication Date 6/15/2021 
Target
Name:
Nuclear receptor ROR-gamma
Synonyms:
NR1F3 Nuclear receptor ROR-gamma (RORC) RAR-related orphan receptor C (RORc) RORG RZRG Retinoid-related orphan receptor-gamma (RORc)
Type:
Enzyme Catalytic Domain
Mol. Mass.:
58218.40
Organism:
Homo sapiens (Human)
Description:
P51449
Residue:
518
  
Inhibitor
Name:
BDBM504262
Synonyms:
(R)-N-(2-(2-Fluoro-3-hydroxy- 3-methylbutyl)-6-(4-(2- methoxyethyl)piperazin-1-yl)-1- oxoisoindolin-5-yl)pyrazolo[1,5- a]pyrimidine-3-carboxamide | US11034698, Example 112
Type:
Small organic molecule
Emp. Form.:
C27H34FN7O4
Mol. Mass.:
539.6018
SMILES:
COCCN1CCN(CC1)c1cc2C(=O)N(C[C@@H](F)C(C)(C)O)Cc2cc1NC(=O)c1cnn2cccnc12
: