Target
Nuclear receptor ROR-gamma
Ligand
BDBM504272
Substrate
Meas. Tech.
Transcreener-Fluorecescence Polarization Assay
Ki
8.20±n/a nM
Citation
 Bryan, MCDo, SDrobnick, JGobbi, AKatsumoto, TKiefer, Jr., JRLiang, JRajapaksa, NSChen, YFu, LLai, KWLiu, ZWai, JWang, F Pyrazolo[ 1,5a]pyrimidine derivatives as IRAK4 modulators US Patent  US11034698 Publication Date 6/15/2021 
Target
Name:
Nuclear receptor ROR-gamma
Synonyms:
NR1F3 Nuclear receptor ROR-gamma (RORC) RAR-related orphan receptor C (RORc) RORG RZRG Retinoid-related orphan receptor-gamma (RORc)
Type:
Enzyme Catalytic Domain
Mol. Mass.:
58218.40
Organism:
Homo sapiens (Human)
Description:
P51449
Residue:
518
  
Inhibitor
Name:
BDBM504272
Synonyms:
N-(6-(Dimethylamino)-7- (hydroxymethyl)-2-isopropyl-1- oxoisoindolin-5-yl)pyrazolo[1,5- a]pyrimidine-3-carboxamide | US11034698, Example 151
Type:
Small organic molecule
Emp. Form.:
C21H24N6O3
Mol. Mass.:
408.4537
SMILES:
CC(C)N1Cc2cc(NC(=O)c3cnn4cccnc34)c(N(C)C)c(CO)c2C1=O
: