Target
Nuclear receptor ROR-gamma
Ligand
BDBM504275
Substrate
Meas. Tech.
Transcreener-Fluorecescence Polarization Assay
Ki
22.0±n/a nM
Citation
 Bryan, MCDo, SDrobnick, JGobbi, AKatsumoto, TKiefer, Jr., JRLiang, JRajapaksa, NSChen, YFu, LLai, KWLiu, ZWai, JWang, F Pyrazolo[ 1,5a]pyrimidine derivatives as IRAK4 modulators US Patent  US11034698 Publication Date 6/15/2021 
Target
Name:
Nuclear receptor ROR-gamma
Synonyms:
NR1F3 Nuclear receptor ROR-gamma (RORC) RAR-related orphan receptor C (RORc) RORG RZRG Retinoid-related orphan receptor-gamma (RORc)
Type:
Enzyme Catalytic Domain
Mol. Mass.:
58218.40
Organism:
Homo sapiens (Human)
Description:
P51449
Residue:
518
  
Inhibitor
Name:
BDBM504275
Synonyms:
US11034698, Example 154 | US11034698, Example 155
Type:
Small organic molecule
Emp. Form.:
C21H23N5O3S
Mol. Mass.:
425.504
SMILES:
CC1(C)Cc2cc(NC(=O)c3cnn4cccnc34)c(cc2[S@]1=O)N1CCOCC1
: