Target
Metabotropic glutamate receptor 4
Ligand
BDBM504287
Substrate
Meas. Tech.
Biological Assay
EC50
39.0±n/a nM
Citation
 Biemans, BGuba, WJaeschke, GLindemann, LO''Hara, FRicci, ARueher, DVieira, E Ethynyl derivatives US Patent  US11034699 Publication Date 6/15/2021 
Target
Name:
Metabotropic glutamate receptor 4
Synonyms:
GPRC1D GRM4_HUMAN MGLUR4 Metabotropic glutamate receptor 4 (mGlu4) metabotropic glutamate 4
Type:
Protein
Mol. Mass.:
101899.95
Organism:
Homo sapiens (Human)
Description:
Q14833
Residue:
912
  
Inhibitor
Name:
BDBM504287
Synonyms:
(4S)-3′-[2,6-Difluoro-4-(2-phenylethynyl)phenyl]-1′,2-dimethyl-spiro[6,7-dihydro-5H-indazole-4,6′-hexahydropyrimidine]-2′,4′-dione | US11034699, Example 13
Type:
Small organic molecule
Emp. Form.:
C26H22F2N4O2
Mol. Mass.:
460.4753
SMILES:
CN1C(=O)N(C(=O)C[C@]11CCCc2nn(C)cc12)c1c(F)cc(cc1F)C#Cc1ccccc1
: