Target
5'-nucleotidase
Ligand
BDBM435826
Substrate
Meas. Tech.
Enzyme In Vitro Assay
IC50
65.0±n/a nM
Citation
 Billedeau, RJLi, JChen, L Ectonucleotidase inhibitors and methods of use thereof US Patent  US11034715 Publication Date 6/15/2021 
Target
Name:
5'-nucleotidase
Synonyms:
5'-NT 5NTD_HUMAN Ecto-5'-nucleotidase NT5 NTE
Type:
Enzyme
Mol. Mass.:
63371.54
Organism:
Homo sapiens (Human)
Description:
P21589
Residue:
574
  
Inhibitor
Name:
BDBM435826
Synonyms:
US10570167, Cpd. # 144 | US11034715, Cpd. # 144
Type:
Small organic molecule
Emp. Form.:
C26H22ClF2N5O7
Mol. Mass.:
589.932
SMILES:
Nc1nc(Cl)nc2n(cnc12)[C@@H]1O[C@H](COC(Cc2ccc(cc2)-c2ccc(F)cc2)(C(O)=O)C(O)=O)[C@@H](O)[C@@H]1F
: