Target
5'-nucleotidase
Ligand
BDBM435848
Substrate
Meas. Tech.
Enzyme In Vitro Assay
IC50
<20.0±n/a nM
Citation
 Billedeau, RJLi, JChen, L Ectonucleotidase inhibitors and methods of use thereof US Patent  US11034715 Publication Date 6/15/2021 
Target
Name:
5'-nucleotidase
Synonyms:
5'-NT 5NTD_HUMAN Ecto-5'-nucleotidase NT5 NTE
Type:
Enzyme
Mol. Mass.:
63371.54
Organism:
Homo sapiens (Human)
Description:
P21589
Residue:
574
  
Inhibitor
Name:
BDBM435848
Synonyms:
US10570167, Cpd. # 174 US11078228, Example 1
Type:
Small organic molecule
Emp. Form.:
C22H20ClN5O8
Mol. Mass.:
517.876
SMILES:
Nc1nc(Cl)nc2n(cnc12)[C@@H]1O[C@H](COC(Cc2ccccc2)(C(O)=O)C(O)=O)[C@](O)(C#C)[C@H]1O
: