Target
5'-nucleotidase
Ligand
BDBM435814
Substrate
Meas. Tech.
Biological Activity of Disclosed Compounds In Vitro
IC50
86.0±n/a nM
Citation
 Billedeau, RJLi, JChen, L Ectonucleotidase inhibitors and methods of use thereof US Patent  US11034715 Publication Date 6/15/2021 
Target
Name:
5'-nucleotidase
Synonyms:
5'-NT 5NTD_HUMAN Ecto-5'-nucleotidase NT5 NTE
Type:
Enzyme
Mol. Mass.:
63371.54
Organism:
Homo sapiens (Human)
Description:
P21589
Residue:
574
  
Inhibitor
Name:
BDBM435814
Synonyms:
US10570167, Cpd. # 129 | US11034715, Cpd. # 129
Type:
Small organic molecule
Emp. Form.:
C25H26ClFN6O8
Mol. Mass.:
592.961
SMILES:
Nc1nc(Cl)nc2n(cnc12)[C@@H]1O[C@H](COC(Cc2ccc(cc2)N2CCCCC2=O)(C(O)=O)C(O)=O)[C@@H](O)[C@@H]1F
: