Target
RNA-binding protein FXR1
Ligand
BDBM504304
Substrate
Meas. Tech.
AlphaScreen Assay
EC50
15.0±4 nM
Citation
 Pellicciari, RGioiello, A Farnesoid X receptor modulators US Patent  US11034717 Publication Date 6/15/2021 
Target
Name:
RNA-binding protein FXR1
Synonyms:
FXR1 Fragile X mental retardation syndrome-related protein 1 | hFXR1p
Type:
Protein
Mol. Mass.:
69715.95
Organism:
Human
Description:
P51114
Residue:
621
  
Inhibitor
Name:
BDBM504304
Synonyms:
3α,7α,11β-rihydroxy-6α-ethyl-5β-cholan-24-O-sulphate, sodium salt | US11034717, Compound 5
Type:
Small organic molecule
Emp. Form.:
C26H45NaO7S
Mol. Mass.:
524.686
SMILES:
CC[C@H]1[C@@H](O)C2C3CC[C@H]([C@H](C)CCCOS(=O)(=O)O[Na])[C@@]3(C)C[C@H](O)C2[C@@]2(C)CC[C@@H](O)C[C@@H]12
: