Target
RNA-binding protein FXR1
Ligand
BDBM504311
Substrate
Meas. Tech.
AlphaScreen Assay
EC50
29.0±5 nM
Citation
 Pellicciari, RGioiello, A Farnesoid X receptor modulators US Patent  US11034717 Publication Date 6/15/2021 
Target
Name:
RNA-binding protein FXR1
Synonyms:
FXR1 Fragile X mental retardation syndrome-related protein 1 | hFXR1p
Type:
Protein
Mol. Mass.:
69715.95
Organism:
Human
Description:
P51114
Residue:
621
  
Inhibitor
Name:
BDBM504311
Synonyms:
3α,7α,11β-trihydroxy-6α-ethyl-23-(1,2,4-oxadiazol-5-oxo-3-yl)-23-nor-5β-cholane | US11034717, Compound 7
Type:
Small organic molecule
Emp. Form.:
C27H44N2O5
Mol. Mass.:
476.6487
SMILES:
CC[C@H]1[C@@H](O)C2C3CC[C@H]([C@H](C)CCc4nc(=O)o[nH]4)[C@@]3(C)C[C@H](O)C2[C@@]2(C)CC[C@@H](O)C[C@@H]12
: