Target
RNA-binding protein FXR1
Ligand
BDBM504309
Substrate
Meas. Tech.
AlphaScreen Assay
EC50
990±50 nM
Citation
 Pellicciari, RGioiello, A Farnesoid X receptor modulators US Patent  US11034717 Publication Date 6/15/2021 
Target
Name:
RNA-binding protein FXR1
Synonyms:
FXR1_MOUSE Fxr1 mFxr1p
Type:
Protein
Mol. Mass.:
76224.09
Organism:
Mouse
Description:
Q61584
Residue:
677
  
Inhibitor
Name:
BDBM504309
Synonyms:
US11034717, Compound L1
Type:
Small organic molecule
Emp. Form.:
C26H44O5
Mol. Mass.:
436.6246
SMILES:
CC[C@H]1[C@@H](O)C2C3CC[C@H]([C@H](C)CCC(O)=O)[C@@]3(C)C[C@H](O)C2[C@@]2(C)CC[C@@H](O)C[C@@H]12
: