Target
Cytochrome P450 11B2, mitochondrial
Ligand
BDBM287667
Substrate
Meas. Tech.
Enzyme Assay
IC50
50±n/a nM
Citation
 Sparks, SYates, CMShaver, SRHoekstra, WJ Metalloenzyme inhibitor compounds US Patent  US11040034 Publication Date 6/22/2021 
Target
Name:
Cytochrome P450 11B2, mitochondrial
Synonyms:
Aldosterone Synthase (CYP11B2) Aldosterone-synthesizing enzyme CYP11B2 Cytochrome P450 11B2 Cytochrome P450 11B2, mitochondrial P-450C18 | Steroid 18-hydroxylase
Type:
Protein
Mol. Mass.:
57582.15
Organism:
Homo sapiens (Human)
Description:
P19099
Residue:
503
  
Inhibitor
Name:
BDBM287667
Synonyms:
US10085984, Example 45 | US11040034, Ex. No. 45
Type:
Small organic molecule
Emp. Form.:
C14H12ClN5
Mol. Mass.:
285.732
SMILES:
Cc1cc(cnn1)-c1nc2ccc(Cl)nc2n1C1CC1
: