Target
Non-receptor tyrosine-protein kinase TYK2
Ligand
BDBM406663
Substrate
Meas. Tech.
ATP Caliper Assay
IC50
56.9±n/a nM
Citation
 Greenwood, JRMasse, CELawson, JPArlin, JPearson, DLoughrey, JJ TYK2 inhibitors, uses, and methods for production thereof US Patent  US11040967 Publication Date 6/22/2021 
Target
Name:
Non-receptor tyrosine-protein kinase TYK2
Synonyms:
Non-receptor tyrosine-protein kinase TYK2 (TYK2) TYK2_HUMAN | Tyrosine-protein kinase TYK2
Type:
Protein
Mol. Mass.:
133666.03
Organism:
Homo sapiens (Human)
Description:
P29597
Residue:
1187
  
Inhibitor
Name:
BDBM406663
Synonyms:
US10336752, Compound 1 US10336752, Compound 4 US10336752, Compound 6 | US11040967, Compound 6
Type:
Small organic molecule
Emp. Form.:
C24H20F2N4O2
Mol. Mass.:
434.438
SMILES:
Fc1cccc(F)c1-c1cc(Nc2ccc(cc2)C(=O)N2CCCC2)c2C(=O)NCc2n1
: