Target
Non-receptor tyrosine-protein kinase TYK2
Ligand
BDBM332916
Substrate
Meas. Tech.
ATP Caliper Assay
IC50
390±n/a nM
Citation
 Greenwood, JRMasse, CELawson, JPArlin, JPearson, DLoughrey, JJ TYK2 inhibitors, uses, and methods for production thereof US Patent  US11040967 Publication Date 6/22/2021 
Target
Name:
Non-receptor tyrosine-protein kinase TYK2
Synonyms:
Non-receptor tyrosine-protein kinase TYK2 (TYK2) TYK2_HUMAN | Tyrosine-protein kinase TYK2
Type:
Protein
Mol. Mass.:
133666.03
Organism:
Homo sapiens (Human)
Description:
P29597
Residue:
1187
  
Inhibitor
Name:
BDBM332916
Synonyms:
US10196390, Compound I-205 US11040967, Compound 7
Type:
Small organic molecule
Emp. Form.:
C22H19F2N5O
Mol. Mass.:
407.416
SMILES:
Fc1cccc(F)c1-c1cc(Nc2ccc(cn2)N2CCCC2)c2C(=O)NCc2n1
: