Target
Non-receptor tyrosine-protein kinase TYK2
Ligand
BDBM406679
Substrate
Meas. Tech.
ATP Caliper Assay
IC50
88.6±n/a nM
Citation
 Greenwood, JRMasse, CELawson, JPArlin, JPearson, DLoughrey, JJ TYK2 inhibitors, uses, and methods for production thereof US Patent  US11040967 Publication Date 6/22/2021 
Target
Name:
Non-receptor tyrosine-protein kinase TYK2
Synonyms:
Non-receptor tyrosine-protein kinase TYK2 (TYK2) TYK2_HUMAN | Tyrosine-protein kinase TYK2
Type:
Protein
Mol. Mass.:
133666.03
Organism:
Homo sapiens (Human)
Description:
P29597
Residue:
1187
  
Inhibitor
Name:
BDBM406679
Synonyms:
US10336752, Compound 17 US11040967, Compound 17
Type:
Small organic molecule
Emp. Form.:
C26H22F2N4O3
Mol. Mass.:
476.4747
SMILES:
Fc1cccc(F)c1-c1cc(Nc2ccc(cc2)C(=O)N2C[C@@H]3COC[C@@H]3C2)c2C(=O)NCc2n1
: