Target
Mitogen-activated protein kinase kinase kinase 5
Ligand
BDBM504331
Substrate
Meas. Tech.
Enzyme Activity
IC50
7.93±n/a nM
Citation
 Wu, CYu, TLi, NChen, S Pyridine derivative as ASK1 inhibitor and preparation method and use thereof US Patent  US11040968 Publication Date 6/22/2021 
Target
Name:
Mitogen-activated protein kinase kinase kinase 5
Synonyms:
ASK1 MAP3K5 MEKK5
Type:
Protein
Mol. Mass.:
154514.93
Organism:
Homo sapiens (Human)
Description:
Q99683
Residue:
1374
  
Inhibitor
Name:
BDBM504331
Synonyms:
US11040968, Example 013 | WX013
Type:
Small organic molecule
Emp. Form.:
C27H27F2N7O2
Mol. Mass.:
519.5458
SMILES:
FCCCOc1cc(F)c(cc1-n1cnc(c1)C1CC1)C(=O)Nc1cccc(n1)-c1nnc2CCCCn12
: