Target
Mitogen-activated protein kinase kinase kinase 5
Ligand
BDBM504333
Substrate
Meas. Tech.
Enzyme Activity
IC50
10.1±n/a nM
Citation
 Wu, CYu, TLi, NChen, S Pyridine derivative as ASK1 inhibitor and preparation method and use thereof US Patent  US11040968 Publication Date 6/22/2021 
Target
Name:
Mitogen-activated protein kinase kinase kinase 5
Synonyms:
ASK1 MAP3K5 MEKK5
Type:
Protein
Mol. Mass.:
154514.93
Organism:
Homo sapiens (Human)
Description:
Q99683
Residue:
1374
  
Inhibitor
Name:
BDBM504333
Synonyms:
US11040968, Example 015 | WX015
Type:
Small organic molecule
Emp. Form.:
C28H29FN8O2
Mol. Mass.:
528.5807
SMILES:
Fc1cc(N2CCOCC2)c(cc1C(=O)Nc1cccc(n1)-c1nnc2CCCCn12)-n1cnc(c1)C1CC1
: