Target
Mitogen-activated protein kinase kinase kinase 5
Ligand
BDBM504334
Substrate
Meas. Tech.
Enzyme Activity
IC50
4.12±n/a nM
Citation
 Wu, CYu, TLi, NChen, S Pyridine derivative as ASK1 inhibitor and preparation method and use thereof US Patent  US11040968 Publication Date 6/22/2021 
Target
Name:
Mitogen-activated protein kinase kinase kinase 5
Synonyms:
ASK1 MAP3K5 MEKK5
Type:
Protein
Mol. Mass.:
154514.93
Organism:
Homo sapiens (Human)
Description:
Q99683
Residue:
1374
  
Inhibitor
Name:
BDBM504334
Synonyms:
US11040968, Example 016 | WX016
Type:
Small organic molecule
Emp. Form.:
C25H24FN7O2
Mol. Mass.:
473.5022
SMILES:
Cc1cc(F)c(cc1-n1cnc(c1)C1CC1)C(=O)Nc1cccc(n1)-c1nnc2C(O)CCCn12
: