Target
Synaptic vesicular amine transporter
Ligand
BDBM504353
Substrate
Meas. Tech.
Inhibitory Activity Assay
Ki
<10±n/a nM
Citation
 Harriott, NHettinger, DBranum, SCulhane, JC VMAT2 inhibitor compounds and compositions thereof US Patent  US11040970 Publication Date 6/22/2021 
Target
Name:
Synaptic vesicular amine transporter
Synonyms:
Monoamine transporter SVMT VAT2 VMAT2_HUMAN | Vesicular amine transporter 2
Type:
PROTEIN
Mol. Mass.:
55709.61
Organism:
Homo sapiens (Human)
Description:
ChEMBL_610810
Residue:
514
  
Inhibitor
Name:
BDBM504353
Synonyms:
US11040970, Compound 5-8
Type:
Small organic molecule
Emp. Form.:
C21H32N2O2
Mol. Mass.:
344.491
SMILES:
COc1cc2C3CN(C)[C@H](CC(C)C)CN3CCc2cc1OCC=C
: