Target
Synaptic vesicular amine transporter
Ligand
BDBM504369
Substrate
Meas. Tech.
Inhibitory Activity Assay
Ki
260±n/a nM
Citation
 Harriott, NHettinger, DBranum, SCulhane, JC VMAT2 inhibitor compounds and compositions thereof US Patent  US11040970 Publication Date 6/22/2021 
Target
Name:
Synaptic vesicular amine transporter
Synonyms:
Monoamine transporter SVMT VAT2 VMAT2_HUMAN | Vesicular amine transporter 2
Type:
PROTEIN
Mol. Mass.:
55709.61
Organism:
Homo sapiens (Human)
Description:
ChEMBL_610810
Residue:
514
  
Inhibitor
Name:
BDBM504369
Synonyms:
US11040970, Compound 8-1 | US11040970, Compound 9-1
Type:
Small organic molecule
Emp. Form.:
C22H33FN2O2
Mol. Mass.:
376.508
SMILES:
COc1cc2C3CN(C)[C@H](CC4CCC4)CN3CCc2cc1OCCCF
: