Target
Tyrosine-protein kinase BTK
Ligand
BDBM143188
Substrate
Meas. Tech.
Enzymatic Activity Assay
IC50
16.1±n/a nM
Citation
 Owens, TVerner, E Substituted pyrazolo[3,4-d]pyrimidines as kinase inhibitors US Patent  US11040980 Publication Date 6/22/2021 
Target
Name:
Tyrosine-protein kinase BTK
Synonyms:
AGMX1 Agammaglobulinaemia tyrosine kinase B cell progenitor kinase BPK BTK_HUMAN Tyrosine Kinase BTK Tyrosine-protein kinase BTK (BTK)
Type:
Enzyme
Mol. Mass.:
76289.95
Organism:
Homo sapiens (Human)
Description:
Q06187
Residue:
659
  
Inhibitor
Name:
BDBM143188
Synonyms:
US11040980, Example 11 US9266895, 11 | US9994576, 11
Type:
Small organic molecule
Emp. Form.:
C32H33FN8O3
Mol. Mass.:
596.6546
SMILES:
CC(C)(NC1COC1)C=C(C#N)C(=O)N1CCC[C@H]1Cn1nc(-c2ccc(Oc3ccccc3)cc2F)c2c(N)ncnc12
: