Target
Tyrosine-protein kinase BTK
Ligand
BDBM143180
Substrate
Meas. Tech.
Enzymatic Activity Assay
IC50
1.90±n/a nM
Citation
 Owens, TVerner, E Substituted pyrazolo[3,4-d]pyrimidines as kinase inhibitors US Patent  US11040980 Publication Date 6/22/2021 
Target
Name:
Tyrosine-protein kinase BTK
Synonyms:
AGMX1 Agammaglobulinaemia tyrosine kinase B cell progenitor kinase BPK BTK_HUMAN Tyrosine Kinase BTK Tyrosine-protein kinase BTK (BTK)
Type:
Enzyme
Mol. Mass.:
76289.95
Organism:
Homo sapiens (Human)
Description:
Q06187
Residue:
659
  
Inhibitor
Name:
BDBM143180
Synonyms:
US11040980, Example 5 US9266895, 5 | US9994576, 5
Type:
Small organic molecule
Emp. Form.:
C33H35FN8O2
Mol. Mass.:
594.6818
SMILES:
CC(C)(C=C(C#N)C(=O)N1CCC[C@H]1Cn1nc(-c2ccc(Oc3ccccc3)cc2F)c2c(N)ncnc12)N1CCCC1
: