Target
Tyrosine-protein kinase BTK
Ligand
BDBM143194
Substrate
Meas. Tech.
Enzymatic Activity Assay
IC50
20.4±n/a nM
Citation
 Owens, TVerner, E Substituted pyrazolo[3,4-d]pyrimidines as kinase inhibitors US Patent  US11040980 Publication Date 6/22/2021 
Target
Name:
Tyrosine-protein kinase BTK
Synonyms:
AGMX1 Agammaglobulinaemia tyrosine kinase B cell progenitor kinase BPK BTK_HUMAN Tyrosine Kinase BTK Tyrosine-protein kinase BTK (BTK)
Type:
Enzyme
Mol. Mass.:
76289.95
Organism:
Homo sapiens (Human)
Description:
Q06187
Residue:
659
  
Inhibitor
Name:
BDBM143194
Synonyms:
US11040980, Example 14 US9266895, 14 | US9994576, 14
Type:
Small organic molecule
Emp. Form.:
C28H26FN7O2
Mol. Mass.:
511.5501
SMILES:
CC(C)C=C(C#N)C(=O)N1CC(Cn2nc(-c3ccc(Oc4ccccc4)cc3F)c3c(N)ncnc23)C1
: