Target
Tyrosine-protein kinase BTK
Ligand
BDBM143202
Substrate
Meas. Tech.
Enzymatic Activity Assay
IC50
0.700±n/a nM
Citation
 Owens, TVerner, E Substituted pyrazolo[3,4-d]pyrimidines as kinase inhibitors US Patent  US11040980 Publication Date 6/22/2021 
Target
Name:
Tyrosine-protein kinase BTK
Synonyms:
AGMX1 Agammaglobulinaemia tyrosine kinase B cell progenitor kinase BPK BTK_HUMAN Tyrosine Kinase BTK Tyrosine-protein kinase BTK (BTK)
Type:
Enzyme
Mol. Mass.:
76289.95
Organism:
Homo sapiens (Human)
Description:
Q06187
Residue:
659
  
Inhibitor
Name:
BDBM143202
Synonyms:
US11040980, Example 21 US9266895, 21 | US9994576, 21
Type:
Small organic molecule
Emp. Form.:
C36H42FN9O2
Mol. Mass.:
651.7762
SMILES:
CC(C)N1CCN(CC1)C(C)(C)C=C(C#N)C(=O)N1CCC[C@H](C1)n1nc(-c2ccc(Oc3ccccc3)cc2F)c2c(N)ncnc12
: