Target
Epidermal growth factor receptor [L858R]
Ligand
BDBM504405
Substrate
Meas. Tech.
Kinase Assay
IC50
30.1±n/a nM
Citation
 Liu, XDing, CZChen, SWu, LHu, LWan, H Quinazoline compound for EGFR inhibition US Patent  US11040984 Publication Date 6/22/2021 
Target
Name:
Epidermal growth factor receptor [L858R]
Synonyms:
EGFR EGFR_HUMAN ERBB1 Epidermal growth factor receptor (L858R) HER1
Type:
Mol. Mass.:
134323.62
Organism:
Homo sapiens (Human)
Description:
P00533[L858R]
Residue:
1210
  
Inhibitor
Name:
BDBM504405
Synonyms:
US11040984, Compound 4
Type:
Small organic molecule
Emp. Form.:
C24H26ClN5O4
Mol. Mass.:
483.947
SMILES:
COc1cc2ncnc(Nc3cccc(Cl)c3OC)c2cc1N1CC2(CCN(C)CC2)OC1=O
: