Target
Small ubiquitin-related modifier 1/2
Ligand
BDBM103828
Substrate
Meas. Tech.
Enzyme Kinetic Assay
IC50
1860±2300 nM
Citation
 Chen, YChen, CNamanja, A Methods of identifying SENP1 inhibitors US Patent  US11041859 Publication Date 6/22/2021 
Target
Name:
Small ubiquitin-related modifier 1/2
Synonyms:
SUMO2/SENP1
Type:
Protein
Mol. Mass.:
Description:
Components:
This complex has 2 components.
Component 1
Name:
Small ubiquitin-related modifier 2
Synonyms:
SMT3B SUMO2 Small ubiquitin-related modifier 2
Type:
Protein
Mol. Mass.:
10869.09
Organism:
Homo sapiens (Human)
Description:
Residue:
95
  
Component 2
Name:
Small ubiquitin-related modifier 1
Synonyms:
SMT3C SUMO1 Small ubiquitin-related modifier 1 | UBL1
Type:
Protein
Mol. Mass.:
11553.84
Organism:
Homo sapiens (Human)
Description:
Residue:
101
  
Inhibitor
Name:
BDBM103828
Synonyms:
SPI-03 | US11041859, Code SPI-03
Type:
Small organic molecule
Emp. Form.:
C34H28N6O6S2
Mol. Mass.:
680.753
SMILES:
Cc1cc(ccc1-c1ccc(cc1C)\N=N\c1cc(c2ccccc2c1N)S(O)(=O)=O)\N=N\c1cc(c2ccccc2c1N)S(O)(=O)=O
: