Target
Small ubiquitin-related modifier 1/2
Ligand
BDBM103834
Substrate
Meas. Tech.
Enzyme Kinetic Assay
IC50
>60000±n/a nM
Citation
 Chen, YChen, CNamanja, A Methods of identifying SENP1 inhibitors US Patent  US11041859 Publication Date 6/22/2021 
Target
Name:
Small ubiquitin-related modifier 1/2
Synonyms:
SUMO2/SENP1
Type:
Protein
Mol. Mass.:
Description:
Components:
This complex has 2 components.
Component 1
Name:
Small ubiquitin-related modifier 2
Synonyms:
SMT3B SUMO2 Small ubiquitin-related modifier 2
Type:
Protein
Mol. Mass.:
10869.09
Organism:
Homo sapiens (Human)
Description:
Residue:
95
  
Component 2
Name:
Small ubiquitin-related modifier 1
Synonyms:
SMT3C SUMO1 Small ubiquitin-related modifier 1 | UBL1
Type:
Protein
Mol. Mass.:
11553.84
Organism:
Homo sapiens (Human)
Description:
Residue:
101
  
Inhibitor
Name:
BDBM103834
Synonyms:
SPI-09 US9791447, Compound SPI-09
Type:
Small organic molecule
Emp. Form.:
C16H13N3O9S3
Mol. Mass.:
487.484
SMILES:
Nc1ccc2cc(cc(c2c1\N=N\c1ccc(cc1)S(O)(=O)=O)S(O)(=O)=O)S(O)(=O)=O
: