Target
Sentrin-specific protease 7
Ligand
BDBM103828
Substrate
Meas. Tech.
Enzyme Kinetic Assay
IC50
4800±1400 nM
Citation
 Chen, YChen, CNamanja, A Methods of identifying SENP1 inhibitors US Patent  US11041859 Publication Date 6/22/2021 
Target
Name:
Sentrin-specific protease 7
Synonyms:
KIAA1707 SENP7_HUMAN SUSP2 | Sentrin-specific protease 7 (SENP7)
Type:
Protein
Mol. Mass.:
119657.39
Organism:
Homo sapiens (Human)
Description:
Q9BQF6
Residue:
1050
  
Inhibitor
Name:
BDBM103828
Synonyms:
SPI-03 | US11041859, Code SPI-03
Type:
Small organic molecule
Emp. Form.:
C34H28N6O6S2
Mol. Mass.:
680.753
SMILES:
Cc1cc(ccc1-c1ccc(cc1C)\N=N\c1cc(c2ccccc2c1N)S(O)(=O)=O)\N=N\c1cc(c2ccccc2c1N)S(O)(=O)=O
: