Target
Sentrin-specific protease 2
Ligand
BDBM103833
Substrate
Meas. Tech.
Enzyme Kinetic Assay
IC50
17200±1500 nM
Citation
 Chen, YChen, CNamanja, A Methods of identifying SENP1 inhibitors US Patent  US11041859 Publication Date 6/22/2021 
Target
Name:
Sentrin-specific protease 2
Synonyms:
KIAA1331 SENP2_HUMAN | Sentrin-specific protease 2 (SENP2)
Type:
Protein
Mol. Mass.:
67890.62
Organism:
Homo sapiens (Human)
Description:
Q9HC62
Residue:
589
  
Inhibitor
Name:
BDBM103833
Synonyms:
SPI-08 US9791447, Compound SPI-08
Type:
Small organic molecule
Emp. Form.:
C16H12N3O3S
Mol. Mass.:
326.35
SMILES:
Nc1c(cc(c2ccccc12)S([O-])(=O)=O)\N=N\c1ccccc1
: