Target
Sentrin-specific protease 2
Ligand
BDBM103834
Substrate
Meas. Tech.
Enzyme Kinetic Assay
IC50
6800±1300 nM
Citation
 Chen, YChen, CNamanja, A Methods of identifying SENP1 inhibitors US Patent  US11041859 Publication Date 6/22/2021 
Target
Name:
Sentrin-specific protease 2
Synonyms:
KIAA1331 SENP2_HUMAN | Sentrin-specific protease 2 (SENP2)
Type:
Protein
Mol. Mass.:
67890.62
Organism:
Homo sapiens (Human)
Description:
Q9HC62
Residue:
589
  
Inhibitor
Name:
BDBM103834
Synonyms:
SPI-09 US9791447, Compound SPI-09
Type:
Small organic molecule
Emp. Form.:
C16H13N3O9S3
Mol. Mass.:
487.484
SMILES:
Nc1ccc2cc(cc(c2c1\N=N\c1ccc(cc1)S(O)(=O)=O)S(O)(=O)=O)S(O)(=O)=O
: