Target
Interleukin-1 receptor-associated kinase 4
Ligand
BDBM50502739
Substrate
Meas. Tech.
Biochemical Assay
IC50
<30±n/a nM
Citation
 Crew, APAraujo, E Compounds and methods for the targeted degradation of interleukin-1 receptor- associated kinase 4 polypeptides US Patent  US11065231 Publication Date 7/20/2021 
Target
Name:
Interleukin-1 receptor-associated kinase 4
Synonyms:
IRAK-4 IRAK4_HUMAN Interleukin-1 receptor-associated kinase 4 (IRAK4) | Renal carcinoma antigen NY-REN-64
Type:
Protein
Mol. Mass.:
51519.08
Organism:
Homo sapiens (Human)
Description:
Q9NWZ3
Residue:
460
  
Inhibitor
Name:
BDBM50502739
Synonyms:
CHEMBL4447648 | US11065231, Example 3
Type:
Small organic molecule
Emp. Form.:
C46H52F3N7O9
Mol. Mass.:
903.9418
SMILES:
OC[C@H]1CC[C@H](CC1)n1c(NC(=O)c2cccc(c2)C(F)(F)F)nc2cc(CN3CCN(CCOCCOCCOc4ccc5C(=O)N(C6CCC(=O)NC6=O)C(=O)c5c4)CC3)ccc12
: